{"text_format":"1","workbook":"xlsx","n_sheets":2,"sheets":["PLANILLA","DATOS"],"not_rendered":{"charts":0,"images":1,"macros":1,"external_links":0,"defined_names":0,"comments":0,"pivot_tables":0},"unopened":[],"bounds":{"document_bytes":16777216,"sheet_cells":100000,"rows_first":2000,"rows_last":500,"rows_between":2000,"halvings":0,"cell_chars":16384,"cell_head_chars":4096},"cells_cut":0,"cells_raw":0,"read":"whole","date_system":"1900"}

{"sheet":"PLANILLA","index":0,"n_rows":108,"n_cols":11,"rows_kept":108,"cut":false,"hidden":false,"merged":[[5,0,5,1],[3,7,3,8],[4,7,4,8],[3,2,3,5],[4,2,4,5],[5,2,5,5],[2,2,2,8],[2,0,2,1],[3,0,3,1],[4,0,4,1],[0,0,0,10]]}
["CAMPEONATO NACIONAL VIRTUAL GAF-GAM 2021"]
[]
["CLUB Y/O INSTITUCION:"]
["ENTRENADOR 1:",null,null,null,null,null,"Teléfono 1:"]
["ENTRENADOR 2:",null,null,null,null,null,"Teléfono 2:"]
["CORREO:"]
[]
["IT","NOMBRES","APELLIDOS","TIPO DOC","NUM DOC","SEXO","FECHA NAC","EDAD","MODALIDAD","CATEGORIA","EQUIPOS"]
[1,null,null,null,null,null,null,{"$f":"IF(G9=\"\",\"\",YEAR(TODAY())-YEAR(G9))","v":""},{"$f":"IFERROR(IF(F9=\"D\",VLOOKUP(CONCATENATE($H9,\"_\",$F9),DATOS!$B$2:$D$27,2,FALSE),VLOOKUP(CONCATENATE($H9,\"_\",$F9),DATOS!$G$2:$I$27,2,FALSE)),\"\")","v":""},{"$f":"IFERROR(IF(F9=\"D\",VLOOKUP(CONCATENATE($H9,\"_\",$F9),DATOS!$B$2:$D$27,3,FALSE),VLOOKUP(CONCATENATE($H9,\"_\",$F9),DATOS!$G$2:$I$27,3,FALSE)),\"\")","v":""}]
[2,null,null,null,null,null,null,{"$f":"IF(G10=\"\",\"\",YEAR(TODAY())-YEAR(G10))","v":""},{"$f":"IFERROR(IF(F10=\"D\",VLOOKUP(CONCATENATE($H10,\"_\",$F10),DATOS!$B$2:$D$27,2,FALSE),VLOOKUP(CONCATENATE($H10,\"_\",$F10),DATOS!$G$2:$I$27,2,FALSE)),\"\")","v":""},{"$f":"IFERROR(IF(F10=\"D\",VLOOKUP(CONCATENATE($H10,\"_\",$F10),DATOS!$B$2:$D$27,3,FALSE),VLOOKUP(CONCATENATE($H10,\"_\",$F10),DATOS!$G$2:$I$27,3,FALSE)),\"\")","v":""}]
[3,null,null,null,null,null,null,"",{"$f":"IFERROR(IF(F11=\"D\",VLOOKUP(CONCATENATE($H11,\"_\",$F11),DATOS!$B$2:$D$27,2,FALSE),VLOOKUP(CONCATENATE($H11,\"_\",$F11),DATOS!$G$2:$I$27,2,FALSE)),\"\")","v":""},{"$f":"IFERROR(IF(F11=\"D\",VLOOKUP(CONCATENATE($H11,\"_\",$F11),DATOS!$B$2:$D$27,3,FALSE),VLOOKUP(CONCATENATE($H11,\"_\",$F11),DATOS!$G$2:$I$27,3,FALSE)),\"\")","v":""}]
[4,null,null,null,null,null,null,"",{"$f":"IFERROR(IF(F12=\"D\",VLOOKUP(CONCATENATE($H12,\"_\",$F12),DATOS!$B$2:$D$27,2,FALSE),VLOOKUP(CONCATENATE($H12,\"_\",$F12),DATOS!$G$2:$I$27,2,FALSE)),\"\")","v":""},{"$f":"IFERROR(IF(F12=\"D\",VLOOKUP(CONCATENATE($H12,\"_\",$F12),DATOS!$B$2:$D$27,3,FALSE),VLOOKUP(CONCATENATE($H12,\"_\",$F12),DATOS!$G$2:$I$27,3,FALSE)),\"\")","v":""}]
[5,null,null,null,null,null,null,"",{"$f":"IFERROR(IF(F13=\"D\",VLOOKUP(CONCATENATE($H13,\"_\",$F13),DATOS!$B$2:$D$27,2,FALSE),VLOOKUP(CONCATENATE($H13,\"_\",$F13),DATOS!$G$2:$I$27,2,FALSE)),\"\")","v":""},{"$f":"IFERROR(IF(F13=\"D\",VLOOKUP(CONCATENATE($H13,\"_\",$F13),DATOS!$B$2:$D$27,3,FALSE),VLOOKUP(CONCATENATE($H13,\"_\",$F13),DATOS!$G$2:$I$27,3,FALSE)),\"\")","v":""}]
[6,null,null,null,null,null,null,"",{"$f":"IFERROR(IF(F14=\"D\",VLOOKUP(CONCATENATE($H14,\"_\",$F14),DATOS!$B$2:$D$27,2,FALSE),VLOOKUP(CONCATENATE($H14,\"_\",$F14),DATOS!$G$2:$I$27,2,FALSE)),\"\")","v":""},{"$f":"IFERROR(IF(F14=\"D\",VLOOKUP(CONCATENATE($H14,\"_\",$F14),DATOS!$B$2:$D$27,3,FALSE),VLOOKUP(CONCATENATE($H14,\"_\",$F14),DATOS!$G$2:$I$27,3,FALSE)),\"\")","v":""}]
[7,null,null,null,null,null,null,"",{"$f":"IFERROR(IF(F15=\"D\",VLOOKUP(CONCATENATE($H15,\"_\",$F15),DATOS!$B$2:$D$27,2,FALSE),VLOOKUP(CONCATENATE($H15,\"_\",$F15),DATOS!$G$2:$I$27,2,FALSE)),\"\")","v":""},{"$f":"IFERROR(IF(F15=\"D\",VLOOKUP(CONCATENATE($H15,\"_\",$F15),DATOS!$B$2:$D$27,3,FALSE),VLOOKUP(CONCATENATE($H15,\"_\",$F15),DATOS!$G$2:$I$27,3,FALSE)),\"\")","v":""}]
[8,null,null,null,null,null,null,"",{"$f":"IFERROR(IF(F16=\"D\",VLOOKUP(CONCATENATE($H16,\"_\",$F16),DATOS!$B$2:$D$27,2,FALSE),VLOOKUP(CONCATENATE($H16,\"_\",$F16),DATOS!$G$2:$I$27,2,FALSE)),\"\")","v":""},{"$f":"IFERROR(IF(F16=\"D\",VLOOKUP(CONCATENATE($H16,\"_\",$F16),DATOS!$B$2:$D$27,3,FALSE),VLOOKUP(CONCATENATE($H16,\"_\",$F16),DATOS!$G$2:$I$27,3,FALSE)),\"\")","v":""}]
[9,null,null,null,null,null,null,"",{"$f":"IFERROR(IF(F17=\"D\",VLOOKUP(CONCATENATE($H17,\"_\",$F17),DATOS!$B$2:$D$27,2,FALSE),VLOOKUP(CONCATENATE($H17,\"_\",$F17),DATOS!$G$2:$I$27,2,FALSE)),\"\")","v":""},{"$f":"IFERROR(IF(F17=\"D\",VLOOKUP(CONCATENATE($H17,\"_\",$F17),DATOS!$B$2:$D$27,3,FALSE),VLOOKUP(CONCATENATE($H17,\"_\",$F17),DATOS!$G$2:$I$27,3,FALSE)),\"\")","v":""}]
[10,null,null,null,null,null,null,"",{"$f":"IFERROR(IF(F18=\"D\",VLOOKUP(CONCATENATE($H18,\"_\",$F18),DATOS!$B$2:$D$27,2,FALSE),VLOOKUP(CONCATENATE($H18,\"_\",$F18),DATOS!$G$2:$I$27,2,FALSE)),\"\")","v":""},{"$f":"IFERROR(IF(F18=\"D\",VLOOKUP(CONCATENATE($H18,\"_\",$F18),DATOS!$B$2:$D$27,3,FALSE),VLOOKUP(CONCATENATE($H18,\"_\",$F18),DATOS!$G$2:$I$27,3,FALSE)),\"\")","v":""}]
[11,null,null,null,null,null,null,"",{"$f":"IFERROR(IF(F19=\"D\",VLOOKUP(CONCATENATE($H19,\"_\",$F19),DATOS!$B$2:$D$27,2,FALSE),VLOOKUP(CONCATENATE($H19,\"_\",$F19),DATOS!$G$2:$I$27,2,FALSE)),\"\")","v":""},{"$f":"IFERROR(IF(F19=\"D\",VLOOKUP(CONCATENATE($H19,\"_\",$F19),DATOS!$B$2:$D$27,3,FALSE),VLOOKUP(CONCATENATE($H19,\"_\",$F19),DATOS!$G$2:$I$27,3,FALSE)),\"\")","v":""}]
[12,null,null,null,null,null,null,"",{"$f":"IFERROR(IF(F20=\"D\",VLOOKUP(CONCATENATE($H20,\"_\",$F20),DATOS!$B$2:$D$27,2,FALSE),VLOOKUP(CONCATENATE($H20,\"_\",$F20),DATOS!$G$2:$I$27,2,FALSE)),\"\")","v":""},{"$f":"IFERROR(IF(F20=\"D\",VLOOKUP(CONCATENATE($H20,\"_\",$F20),DATOS!$B$2:$D$27,3,FALSE),VLOOKUP(CONCATENATE($H20,\"_\",$F20),DATOS!$G$2:$I$27,3,FALSE)),\"\")","v":""}]
[13,null,null,null,null,null,null,"",{"$f":"IFERROR(IF(F21=\"D\",VLOOKUP(CONCATENATE($H21,\"_\",$F21),DATOS!$B$2:$D$27,2,FALSE),VLOOKUP(CONCATENATE($H21,\"_\",$F21),DATOS!$G$2:$I$27,2,FALSE)),\"\")","v":""},{"$f":"IFERROR(IF(F21=\"D\",VLOOKUP(CONCATENATE($H21,\"_\",$F21),DATOS!$B$2:$D$27,3,FALSE),VLOOKUP(CONCATENATE($H21,\"_\",$F21),DATOS!$G$2:$I$27,3,FALSE)),\"\")","v":""}]
[14,null,null,null,null,null,null,"",{"$f":"IFERROR(IF(F22=\"D\",VLOOKUP(CONCATENATE($H22,\"_\",$F22),DATOS!$B$2:$D$27,2,FALSE),VLOOKUP(CONCATENATE($H22,\"_\",$F22),DATOS!$G$2:$I$27,2,FALSE)),\"\")","v":""},{"$f":"IFERROR(IF(F22=\"D\",VLOOKUP(CONCATENATE($H22,\"_\",$F22),DATOS!$B$2:$D$27,3,FALSE),VLOOKUP(CONCATENATE($H22,\"_\",$F22),DATOS!$G$2:$I$27,3,FALSE)),\"\")","v":""}]
[15,null,null,null,null,null,null,"",{"$f":"IFERROR(IF(F23=\"D\",VLOOKUP(CONCATENATE($H23,\"_\",$F23),DATOS!$B$2:$D$27,2,FALSE),VLOOKUP(CONCATENATE($H23,\"_\",$F23),DATOS!$G$2:$I$27,2,FALSE)),\"\")","v":""},{"$f":"IFERROR(IF(F23=\"D\",VLOOKUP(CONCATENATE($H23,\"_\",$F23),DATOS!$B$2:$D$27,3,FALSE),VLOOKUP(CONCATENATE($H23,\"_\",$F23),DATOS!$G$2:$I$27,3,FALSE)),\"\")","v":""}]
[16,null,null,null,null,null,null,"",{"$f":"IFERROR(IF(F24=\"D\",VLOOKUP(CONCATENATE($H24,\"_\",$F24),DATOS!$B$2:$D$27,2,FALSE),VLOOKUP(CONCATENATE($H24,\"_\",$F24),DATOS!$G$2:$I$27,2,FALSE)),\"\")","v":""},{"$f":"IFERROR(IF(F24=\"D\",VLOOKUP(CONCATENATE($H24,\"_\",$F24),DATOS!$B$2:$D$27,3,FALSE),VLOOKUP(CONCATENATE($H24,\"_\",$F24),DATOS!$G$2:$I$27,3,FALSE)),\"\")","v":""}]
[17,null,null,null,null,null,null,"",{"$f":"IFERROR(IF(F25=\"D\",VLOOKUP(CONCATENATE($H25,\"_\",$F25),DATOS!$B$2:$D$27,2,FALSE),VLOOKUP(CONCATENATE($H25,\"_\",$F25),DATOS!$G$2:$I$27,2,FALSE)),\"\")","v":""},{"$f":"IFERROR(IF(F25=\"D\",VLOOKUP(CONCATENATE($H25,\"_\",$F25),DATOS!$B$2:$D$27,3,FALSE),VLOOKUP(CONCATENATE($H25,\"_\",$F25),DATOS!$G$2:$I$27,3,FALSE)),\"\")","v":""}]
[18,null,null,null,null,null,null,"",{"$f":"IFERROR(IF(F26=\"D\",VLOOKUP(CONCATENATE($H26,\"_\",$F26),DATOS!$B$2:$D$27,2,FALSE),VLOOKUP(CONCATENATE($H26,\"_\",$F26),DATOS!$G$2:$I$27,2,FALSE)),\"\")","v":""},{"$f":"IFERROR(IF(F26=\"D\",VLOOKUP(CONCATENATE($H26,\"_\",$F26),DATOS!$B$2:$D$27,3,FALSE),VLOOKUP(CONCATENATE($H26,\"_\",$F26),DATOS!$G$2:$I$27,3,FALSE)),\"\")","v":""}]
[19,null,null,null,null,null,null,"",{"$f":"IFERROR(IF(F27=\"D\",VLOOKUP(CONCATENATE($H27,\"_\",$F27),DATOS!$B$2:$D$27,2,FALSE),VLOOKUP(CONCATENATE($H27,\"_\",$F27),DATOS!$G$2:$I$27,2,FALSE)),\"\")","v":""},{"$f":"IFERROR(IF(F27=\"D\",VLOOKUP(CONCATENATE($H27,\"_\",$F27),DATOS!$B$2:$D$27,3,FALSE),VLOOKUP(CONCATENATE($H27,\"_\",$F27),DATOS!$G$2:$I$27,3,FALSE)),\"\")","v":""}]
[20,null,null,null,null,null,null,"",{"$f":"IFERROR(IF(F28=\"D\",VLOOKUP(CONCATENATE($H28,\"_\",$F28),DATOS!$B$2:$D$27,2,FALSE),VLOOKUP(CONCATENATE($H28,\"_\",$F28),DATOS!$G$2:$I$27,2,FALSE)),\"\")","v":""},{"$f":"IFERROR(IF(F28=\"D\",VLOOKUP(CONCATENATE($H28,\"_\",$F28),DATOS!$B$2:$D$27,3,FALSE),VLOOKUP(CONCATENATE($H28,\"_\",$F28),DATOS!$G$2:$I$27,3,FALSE)),\"\")","v":""}]
[21,null,null,null,null,null,null,"",{"$f":"IFERROR(IF(F29=\"D\",VLOOKUP(CONCATENATE($H29,\"_\",$F29),DATOS!$B$2:$D$27,2,FALSE),VLOOKUP(CONCATENATE($H29,\"_\",$F29),DATOS!$G$2:$I$27,2,FALSE)),\"\")","v":""},{"$f":"IFERROR(IF(F29=\"D\",VLOOKUP(CONCATENATE($H29,\"_\",$F29),DATOS!$B$2:$D$27,3,FALSE),VLOOKUP(CONCATENATE($H29,\"_\",$F29),DATOS!$G$2:$I$27,3,FALSE)),\"\")","v":""}]
[22,null,null,null,null,null,null,"",{"$f":"IFERROR(IF(F30=\"D\",VLOOKUP(CONCATENATE($H30,\"_\",$F30),DATOS!$B$2:$D$27,2,FALSE),VLOOKUP(CONCATENATE($H30,\"_\",$F30),DATOS!$G$2:$I$27,2,FALSE)),\"\")","v":""},{"$f":"IFERROR(IF(F30=\"D\",VLOOKUP(CONCATENATE($H30,\"_\",$F30),DATOS!$B$2:$D$27,3,FALSE),VLOOKUP(CONCATENATE($H30,\"_\",$F30),DATOS!$G$2:$I$27,3,FALSE)),\"\")","v":""}]
[23,null,null,null,null,null,null,"",{"$f":"IFERROR(IF(F31=\"D\",VLOOKUP(CONCATENATE($H31,\"_\",$F31),DATOS!$B$2:$D$27,2,FALSE),VLOOKUP(CONCATENATE($H31,\"_\",$F31),DATOS!$G$2:$I$27,2,FALSE)),\"\")","v":""},{"$f":"IFERROR(IF(F31=\"D\",VLOOKUP(CONCATENATE($H31,\"_\",$F31),DATOS!$B$2:$D$27,3,FALSE),VLOOKUP(CONCATENATE($H31,\"_\",$F31),DATOS!$G$2:$I$27,3,FALSE)),\"\")","v":""}]
[24,null,null,null,null,null,null,"",{"$f":"IFERROR(IF(F32=\"D\",VLOOKUP(CONCATENATE($H32,\"_\",$F32),DATOS!$B$2:$D$27,2,FALSE),VLOOKUP(CONCATENATE($H32,\"_\",$F32),DATOS!$G$2:$I$27,2,FALSE)),\"\")","v":""},{"$f":"IFERROR(IF(F32=\"D\",VLOOKUP(CONCATENATE($H32,\"_\",$F32),DATOS!$B$2:$D$27,3,FALSE),VLOOKUP(CONCATENATE($H32,\"_\",$F32),DATOS!$G$2:$I$27,3,FALSE)),\"\")","v":""}]
[25,null,null,null,null,null,null,"",{"$f":"IFERROR(IF(F33=\"D\",VLOOKUP(CONCATENATE($H33,\"_\",$F33),DATOS!$B$2:$D$27,2,FALSE),VLOOKUP(CONCATENATE($H33,\"_\",$F33),DATOS!$G$2:$I$27,2,FALSE)),\"\")","v":""},{"$f":"IFERROR(IF(F33=\"D\",VLOOKUP(CONCATENATE($H33,\"_\",$F33),DATOS!$B$2:$D$27,3,FALSE),VLOOKUP(CONCATENATE($H33,\"_\",$F33),DATOS!$G$2:$I$27,3,FALSE)),\"\")","v":""}]
[26,null,null,null,null,null,null,"",{"$f":"IFERROR(IF(F34=\"D\",VLOOKUP(CONCATENATE($H34,\"_\",$F34),DATOS!$B$2:$D$27,2,FALSE),VLOOKUP(CONCATENATE($H34,\"_\",$F34),DATOS!$G$2:$I$27,2,FALSE)),\"\")","v":""},{"$f":"IFERROR(IF(F34=\"D\",VLOOKUP(CONCATENATE($H34,\"_\",$F34),DATOS!$B$2:$D$27,3,FALSE),VLOOKUP(CONCATENATE($H34,\"_\",$F34),DATOS!$G$2:$I$27,3,FALSE)),\"\")","v":""}]
[27,null,null,null,null,null,null,"",{"$f":"IFERROR(IF(F35=\"D\",VLOOKUP(CONCATENATE($H35,\"_\",$F35),DATOS!$B$2:$D$27,2,FALSE),VLOOKUP(CONCATENATE($H35,\"_\",$F35),DATOS!$G$2:$I$27,2,FALSE)),\"\")","v":""},{"$f":"IFERROR(IF(F35=\"D\",VLOOKUP(CONCATENATE($H35,\"_\",$F35),DATOS!$B$2:$D$27,3,FALSE),VLOOKUP(CONCATENATE($H35,\"_\",$F35),DATOS!$G$2:$I$27,3,FALSE)),\"\")","v":""}]
[28,null,null,null,null,null,null,"",{"$f":"IFERROR(IF(F36=\"D\",VLOOKUP(CONCATENATE($H36,\"_\",$F36),DATOS!$B$2:$D$27,2,FALSE),VLOOKUP(CONCATENATE($H36,\"_\",$F36),DATOS!$G$2:$I$27,2,FALSE)),\"\")","v":""},{"$f":"IFERROR(IF(F36=\"D\",VLOOKUP(CONCATENATE($H36,\"_\",$F36),DATOS!$B$2:$D$27,3,FALSE),VLOOKUP(CONCATENATE($H36,\"_\",$F36),DATOS!$G$2:$I$27,3,FALSE)),\"\")","v":""}]
[29,null,null,null,null,null,null,"",{"$f":"IFERROR(IF(F37=\"D\",VLOOKUP(CONCATENATE($H37,\"_\",$F37),DATOS!$B$2:$D$27,2,FALSE),VLOOKUP(CONCATENATE($H37,\"_\",$F37),DATOS!$G$2:$I$27,2,FALSE)),\"\")","v":""},{"$f":"IFERROR(IF(F37=\"D\",VLOOKUP(CONCATENATE($H37,\"_\",$F37),DATOS!$B$2:$D$27,3,FALSE),VLOOKUP(CONCATENATE($H37,\"_\",$F37),DATOS!$G$2:$I$27,3,FALSE)),\"\")","v":""}]
[30,null,null,null,null,null,null,"",{"$f":"IFERROR(IF(F38=\"D\",VLOOKUP(CONCATENATE($H38,\"_\",$F38),DATOS!$B$2:$D$27,2,FALSE),VLOOKUP(CONCATENATE($H38,\"_\",$F38),DATOS!$G$2:$I$27,2,FALSE)),\"\")","v":""},{"$f":"IFERROR(IF(F38=\"D\",VLOOKUP(CONCATENATE($H38,\"_\",$F38),DATOS!$B$2:$D$27,3,FALSE),VLOOKUP(CONCATENATE($H38,\"_\",$F38),DATOS!$G$2:$I$27,3,FALSE)),\"\")","v":""}]
[31,null,null,null,null,null,null,"",{"$f":"IFERROR(IF(F39=\"D\",VLOOKUP(CONCATENATE($H39,\"_\",$F39),DATOS!$B$2:$D$27,2,FALSE),VLOOKUP(CONCATENATE($H39,\"_\",$F39),DATOS!$G$2:$I$27,2,FALSE)),\"\")","v":""},{"$f":"IFERROR(IF(F39=\"D\",VLOOKUP(CONCATENATE($H39,\"_\",$F39),DATOS!$B$2:$D$27,3,FALSE),VLOOKUP(CONCATENATE($H39,\"_\",$F39),DATOS!$G$2:$I$27,3,FALSE)),\"\")","v":""}]
[32,null,null,null,null,null,null,"",{"$f":"IFERROR(IF(F40=\"D\",VLOOKUP(CONCATENATE($H40,\"_\",$F40),DATOS!$B$2:$D$27,2,FALSE),VLOOKUP(CONCATENATE($H40,\"_\",$F40),DATOS!$G$2:$I$27,2,FALSE)),\"\")","v":""},{"$f":"IFERROR(IF(F40=\"D\",VLOOKUP(CONCATENATE($H40,\"_\",$F40),DATOS!$B$2:$D$27,3,FALSE),VLOOKUP(CONCATENATE($H40,\"_\",$F40),DATOS!$G$2:$I$27,3,FALSE)),\"\")","v":""}]
[33,null,null,null,null,null,null,"",{"$f":"IFERROR(IF(F41=\"D\",VLOOKUP(CONCATENATE($H41,\"_\",$F41),DATOS!$B$2:$D$27,2,FALSE),VLOOKUP(CONCATENATE($H41,\"_\",$F41),DATOS!$G$2:$I$27,2,FALSE)),\"\")","v":""},{"$f":"IFERROR(IF(F41=\"D\",VLOOKUP(CONCATENATE($H41,\"_\",$F41),DATOS!$B$2:$D$27,3,FALSE),VLOOKUP(CONCATENATE($H41,\"_\",$F41),DATOS!$G$2:$I$27,3,FALSE)),\"\")","v":""}]
[34,null,null,null,null,null,null,"",{"$f":"IFERROR(IF(F42=\"D\",VLOOKUP(CONCATENATE($H42,\"_\",$F42),DATOS!$B$2:$D$27,2,FALSE),VLOOKUP(CONCATENATE($H42,\"_\",$F42),DATOS!$G$2:$I$27,2,FALSE)),\"\")","v":""},{"$f":"IFERROR(IF(F42=\"D\",VLOOKUP(CONCATENATE($H42,\"_\",$F42),DATOS!$B$2:$D$27,3,FALSE),VLOOKUP(CONCATENATE($H42,\"_\",$F42),DATOS!$G$2:$I$27,3,FALSE)),\"\")","v":""}]
[35,null,null,null,null,null,null,"",{"$f":"IFERROR(IF(F43=\"D\",VLOOKUP(CONCATENATE($H43,\"_\",$F43),DATOS!$B$2:$D$27,2,FALSE),VLOOKUP(CONCATENATE($H43,\"_\",$F43),DATOS!$G$2:$I$27,2,FALSE)),\"\")","v":""},{"$f":"IFERROR(IF(F43=\"D\",VLOOKUP(CONCATENATE($H43,\"_\",$F43),DATOS!$B$2:$D$27,3,FALSE),VLOOKUP(CONCATENATE($H43,\"_\",$F43),DATOS!$G$2:$I$27,3,FALSE)),\"\")","v":""}]
[36,null,null,null,null,null,null,"",{"$f":"IFERROR(IF(F44=\"D\",VLOOKUP(CONCATENATE($H44,\"_\",$F44),DATOS!$B$2:$D$27,2,FALSE),VLOOKUP(CONCATENATE($H44,\"_\",$F44),DATOS!$G$2:$I$27,2,FALSE)),\"\")","v":""},{"$f":"IFERROR(IF(F44=\"D\",VLOOKUP(CONCATENATE($H44,\"_\",$F44),DATOS!$B$2:$D$27,3,FALSE),VLOOKUP(CONCATENATE($H44,\"_\",$F44),DATOS!$G$2:$I$27,3,FALSE)),\"\")","v":""}]
[37,null,null,null,null,null,null,"",{"$f":"IFERROR(IF(F45=\"D\",VLOOKUP(CONCATENATE($H45,\"_\",$F45),DATOS!$B$2:$D$27,2,FALSE),VLOOKUP(CONCATENATE($H45,\"_\",$F45),DATOS!$G$2:$I$27,2,FALSE)),\"\")","v":""},{"$f":"IFERROR(IF(F45=\"D\",VLOOKUP(CONCATENATE($H45,\"_\",$F45),DATOS!$B$2:$D$27,3,FALSE),VLOOKUP(CONCATENATE($H45,\"_\",$F45),DATOS!$G$2:$I$27,3,FALSE)),\"\")","v":""}]
[38,null,null,null,null,null,null,"",{"$f":"IFERROR(IF(F46=\"D\",VLOOKUP(CONCATENATE($H46,\"_\",$F46),DATOS!$B$2:$D$27,2,FALSE),VLOOKUP(CONCATENATE($H46,\"_\",$F46),DATOS!$G$2:$I$27,2,FALSE)),\"\")","v":""},{"$f":"IFERROR(IF(F46=\"D\",VLOOKUP(CONCATENATE($H46,\"_\",$F46),DATOS!$B$2:$D$27,3,FALSE),VLOOKUP(CONCATENATE($H46,\"_\",$F46),DATOS!$G$2:$I$27,3,FALSE)),\"\")","v":""}]
[39,null,null,null,null,null,null,"",{"$f":"IFERROR(IF(F47=\"D\",VLOOKUP(CONCATENATE($H47,\"_\",$F47),DATOS!$B$2:$D$27,2,FALSE),VLOOKUP(CONCATENATE($H47,\"_\",$F47),DATOS!$G$2:$I$27,2,FALSE)),\"\")","v":""},{"$f":"IFERROR(IF(F47=\"D\",VLOOKUP(CONCATENATE($H47,\"_\",$F47),DATOS!$B$2:$D$27,3,FALSE),VLOOKUP(CONCATENATE($H47,\"_\",$F47),DATOS!$G$2:$I$27,3,FALSE)),\"\")","v":""}]
[40,null,null,null,null,null,null,"",{"$f":"IFERROR(IF(F48=\"D\",VLOOKUP(CONCATENATE($H48,\"_\",$F48),DATOS!$B$2:$D$27,2,FALSE),VLOOKUP(CONCATENATE($H48,\"_\",$F48),DATOS!$G$2:$I$27,2,FALSE)),\"\")","v":""},{"$f":"IFERROR(IF(F48=\"D\",VLOOKUP(CONCATENATE($H48,\"_\",$F48),DATOS!$B$2:$D$27,3,FALSE),VLOOKUP(CONCATENATE($H48,\"_\",$F48),DATOS!$G$2:$I$27,3,FALSE)),\"\")","v":""}]
[41,null,null,null,null,null,null,"",{"$f":"IFERROR(IF(F49=\"D\",VLOOKUP(CONCATENATE($H49,\"_\",$F49),DATOS!$B$2:$D$27,2,FALSE),VLOOKUP(CONCATENATE($H49,\"_\",$F49),DATOS!$G$2:$I$27,2,FALSE)),\"\")","v":""},{"$f":"IFERROR(IF(F49=\"D\",VLOOKUP(CONCATENATE($H49,\"_\",$F49),DATOS!$B$2:$D$27,3,FALSE),VLOOKUP(CONCATENATE($H49,\"_\",$F49),DATOS!$G$2:$I$27,3,FALSE)),\"\")","v":""}]
[42,null,null,null,null,null,null,"",{"$f":"IFERROR(IF(F50=\"D\",VLOOKUP(CONCATENATE($H50,\"_\",$F50),DATOS!$B$2:$D$27,2,FALSE),VLOOKUP(CONCATENATE($H50,\"_\",$F50),DATOS!$G$2:$I$27,2,FALSE)),\"\")","v":""},{"$f":"IFERROR(IF(F50=\"D\",VLOOKUP(CONCATENATE($H50,\"_\",$F50),DATOS!$B$2:$D$27,3,FALSE),VLOOKUP(CONCATENATE($H50,\"_\",$F50),DATOS!$G$2:$I$27,3,FALSE)),\"\")","v":""}]
[43,null,null,null,null,null,null,"",{"$f":"IFERROR(IF(F51=\"D\",VLOOKUP(CONCATENATE($H51,\"_\",$F51),DATOS!$B$2:$D$27,2,FALSE),VLOOKUP(CONCATENATE($H51,\"_\",$F51),DATOS!$G$2:$I$27,2,FALSE)),\"\")","v":""},{"$f":"IFERROR(IF(F51=\"D\",VLOOKUP(CONCATENATE($H51,\"_\",$F51),DATOS!$B$2:$D$27,3,FALSE),VLOOKUP(CONCATENATE($H51,\"_\",$F51),DATOS!$G$2:$I$27,3,FALSE)),\"\")","v":""}]
[44,null,null,null,null,null,null,"",{"$f":"IFERROR(IF(F52=\"D\",VLOOKUP(CONCATENATE($H52,\"_\",$F52),DATOS!$B$2:$D$27,2,FALSE),VLOOKUP(CONCATENATE($H52,\"_\",$F52),DATOS!$G$2:$I$27,2,FALSE)),\"\")","v":""},{"$f":"IFERROR(IF(F52=\"D\",VLOOKUP(CONCATENATE($H52,\"_\",$F52),DATOS!$B$2:$D$27,3,FALSE),VLOOKUP(CONCATENATE($H52,\"_\",$F52),DATOS!$G$2:$I$27,3,FALSE)),\"\")","v":""}]
[45,null,null,null,null,null,null,"",{"$f":"IFERROR(IF(F53=\"D\",VLOOKUP(CONCATENATE($H53,\"_\",$F53),DATOS!$B$2:$D$27,2,FALSE),VLOOKUP(CONCATENATE($H53,\"_\",$F53),DATOS!$G$2:$I$27,2,FALSE)),\"\")","v":""},{"$f":"IFERROR(IF(F53=\"D\",VLOOKUP(CONCATENATE($H53,\"_\",$F53),DATOS!$B$2:$D$27,3,FALSE),VLOOKUP(CONCATENATE($H53,\"_\",$F53),DATOS!$G$2:$I$27,3,FALSE)),\"\")","v":""}]
[46,null,null,null,null,null,null,"",{"$f":"IFERROR(IF(F54=\"D\",VLOOKUP(CONCATENATE($H54,\"_\",$F54),DATOS!$B$2:$D$27,2,FALSE),VLOOKUP(CONCATENATE($H54,\"_\",$F54),DATOS!$G$2:$I$27,2,FALSE)),\"\")","v":""},{"$f":"IFERROR(IF(F54=\"D\",VLOOKUP(CONCATENATE($H54,\"_\",$F54),DATOS!$B$2:$D$27,3,FALSE),VLOOKUP(CONCATENATE($H54,\"_\",$F54),DATOS!$G$2:$I$27,3,FALSE)),\"\")","v":""}]
[47,null,null,null,null,null,null,"",{"$f":"IFERROR(IF(F55=\"D\",VLOOKUP(CONCATENATE($H55,\"_\",$F55),DATOS!$B$2:$D$27,2,FALSE),VLOOKUP(CONCATENATE($H55,\"_\",$F55),DATOS!$G$2:$I$27,2,FALSE)),\"\")","v":""},{"$f":"IFERROR(IF(F55=\"D\",VLOOKUP(CONCATENATE($H55,\"_\",$F55),DATOS!$B$2:$D$27,3,FALSE),VLOOKUP(CONCATENATE($H55,\"_\",$F55),DATOS!$G$2:$I$27,3,FALSE)),\"\")","v":""}]
[48,null,null,null,null,null,null,"",{"$f":"IFERROR(IF(F56=\"D\",VLOOKUP(CONCATENATE($H56,\"_\",$F56),DATOS!$B$2:$D$27,2,FALSE),VLOOKUP(CONCATENATE($H56,\"_\",$F56),DATOS!$G$2:$I$27,2,FALSE)),\"\")","v":""},{"$f":"IFERROR(IF(F56=\"D\",VLOOKUP(CONCATENATE($H56,\"_\",$F56),DATOS!$B$2:$D$27,3,FALSE),VLOOKUP(CONCATENATE($H56,\"_\",$F56),DATOS!$G$2:$I$27,3,FALSE)),\"\")","v":""}]
[49,null,null,null,null,null,null,"",{"$f":"IFERROR(IF(F57=\"D\",VLOOKUP(CONCATENATE($H57,\"_\",$F57),DATOS!$B$2:$D$27,2,FALSE),VLOOKUP(CONCATENATE($H57,\"_\",$F57),DATOS!$G$2:$I$27,2,FALSE)),\"\")","v":""},{"$f":"IFERROR(IF(F57=\"D\",VLOOKUP(CONCATENATE($H57,\"_\",$F57),DATOS!$B$2:$D$27,3,FALSE),VLOOKUP(CONCATENATE($H57,\"_\",$F57),DATOS!$G$2:$I$27,3,FALSE)),\"\")","v":""}]
[50,null,null,null,null,null,null,"",{"$f":"IFERROR(IF(F58=\"D\",VLOOKUP(CONCATENATE($H58,\"_\",$F58),DATOS!$B$2:$D$27,2,FALSE),VLOOKUP(CONCATENATE($H58,\"_\",$F58),DATOS!$G$2:$I$27,2,FALSE)),\"\")","v":""},{"$f":"IFERROR(IF(F58=\"D\",VLOOKUP(CONCATENATE($H58,\"_\",$F58),DATOS!$B$2:$D$27,3,FALSE),VLOOKUP(CONCATENATE($H58,\"_\",$F58),DATOS!$G$2:$I$27,3,FALSE)),\"\")","v":""}]
[51,null,null,null,null,null,null,"",{"$f":"IFERROR(IF(F59=\"D\",VLOOKUP(CONCATENATE($H59,\"_\",$F59),DATOS!$B$2:$D$27,2,FALSE),VLOOKUP(CONCATENATE($H59,\"_\",$F59),DATOS!$G$2:$I$27,2,FALSE)),\"\")","v":""},{"$f":"IFERROR(IF(F59=\"D\",VLOOKUP(CONCATENATE($H59,\"_\",$F59),DATOS!$B$2:$D$27,3,FALSE),VLOOKUP(CONCATENATE($H59,\"_\",$F59),DATOS!$G$2:$I$27,3,FALSE)),\"\")","v":""}]
[52,null,null,null,null,null,null,"",{"$f":"IFERROR(IF(F60=\"D\",VLOOKUP(CONCATENATE($H60,\"_\",$F60),DATOS!$B$2:$D$27,2,FALSE),VLOOKUP(CONCATENATE($H60,\"_\",$F60),DATOS!$G$2:$I$27,2,FALSE)),\"\")","v":""},{"$f":"IFERROR(IF(F60=\"D\",VLOOKUP(CONCATENATE($H60,\"_\",$F60),DATOS!$B$2:$D$27,3,FALSE),VLOOKUP(CONCATENATE($H60,\"_\",$F60),DATOS!$G$2:$I$27,3,FALSE)),\"\")","v":""}]
{"$rows_left_out":49}
{"sheet":"DATOS","index":1,"n_rows":27,"n_cols":9,"rows_kept":27,"cut":false,"hidden":true,"merged":[]}
["EDAD","CLAVE","DAMAS_CAT","DAMAS_EDAD",null,"EDAD","CLAVE","VARONES_CAT","VARONES_EDAD"]
[5,{"$f":"CONCATENATE(A2,\"_D\")","v":"5_D"},"C-1","5-6 Años",null,6,{"$f":"CONCATENATE(F2,\"_V\")","v":"6_V"},"C-1","6-7 Años"]
[6,{"$f":"CONCATENATE(A3,\"_D\")","v":"6_D"},"C-1","5-6 Años",null,7,{"$f":"CONCATENATE(F3,\"_V\")","v":"7_V"},"C-1","6-7 Años"]
[7,"7_D","C-2","7 Años",null,8,"8_V","C-2","8 Años"]
[8,"8_D","C-3","8 Años",null,9,"9_V","C-3","9 Años"]
[9,"9_D","C-4","9 Años",null,10,"10_V","C-4","10 Años"]
[10,"10_D","C-5","10 Años",null,11,"11_V","C-5","11-12 Años"]
[11,"11_D","C-6","11-12 Años",null,12,"12_V","C-5","11-12 Años"]
[12,"12_D","C-6","11-12 Años",null,13,"13_V","C-6","13-14 Años"]
[13,"13_D","C-7","13-14 Años",null,14,"14_V","C-6","13-14 Años"]
[14,"14_D","C-7","13-14 Años",null,15,"15_V","C-7","15-17 Años"]
[15,"15_D","C-8","15+ Años",null,16,"16_V","C-7","15-17 Años"]
[16,"16_D","C-8","15+ Años",null,17,"17_V","C-7","15-17 Años"]
[17,"17_D","C-8","15+ Años",null,18,"18_V","C-8","18+ Años"]
[18,"18_D","C-8","15+ Años",null,19,"19_V","C-8","18+ Años"]
[19,"19_D","C-8","15+ Años",null,20,"20_V","C-8","18+ Años"]
[20,"20_D","C-8","15+ Años",null,21,"21_V","C-8","18+ Años"]
[21,"21_D","C-8","15+ Años",null,22,"22_V","C-8","18+ Años"]
[22,"22_D","C-8","15+ Años",null,23,"23_V","C-8","18+ Años"]
[23,"23_D","C-8","15+ Años",null,24,"24_V","C-8","18+ Años"]
[24,"24_D","C-8","15+ Años",null,25,"25_V","C-8","18+ Años"]
[25,"25_D","C-8","15+ Años",null,26,"26_V","C-8","18+ Años"]
[26,"26_D","C-8","15+ Años",null,27,"27_V","C-8","18+ Años"]
[27,"27_D","C-8","15+ Años",null,28,"28_V","C-8","18+ Años"]
[28,"28_D","C-8","15+ Años",null,29,"29_V","C-8","18+ Años"]
[29,"29_D","C-8","15+ Años",null,30,"30_V","C-8","18+ Años"]
[30,"30_D","C-8","15+ Años"]